Add Makefile and set compat to 12

6 jobs for update/6.2.4 in 34 minutes and 58 seconds (queued for 4 seconds)
Status Name Job ID Coverage
  Build
failed build/debian/buster #110149
docker

00:33:03

failed build/ubuntu/bionic #110151
docker

00:00:26

failed build/ubuntu/focal #110150
docker

00:34:56

 
  Test
skipped test/debian/buster #110152
docker
skipped test/ubuntu/bionic #110154
docker
skipped test/ubuntu/focal #110153
docker
 
Name Stage Failure
failed
build/ubuntu/bionic Build
  libjemalloc-dev{a} libjemalloc1{a} liblua5.1-0{a} liblua5.1-0-dev{a} libreadline-dev{a} libssl-dev{a} libsystemd-dev{a} libtinfo-dev{a} lua-bitop{a} lua-bitop-dev{a} lua-cjson{a} lua-cjson-dev{a} tcl{a} tcl-tls{a} 
The following packages are RECOMMENDED but will NOT be installed:
libtool libtool-bin
0 packages upgraded, 14 newly installed, 0 to remove and 0 not upgraded.
Need to get 2549 kB of archives. After unpacking 12.7 MB will be used.
Abort.
[ binary build failed! ]
Cleaning up file based variables
ERROR: Job failed: exit code 1
failed
build/ubuntu/focal Build
make[2]: Leaving directory '/builds/packaging/deb-redis/build/icinga-redis/src'
make[1]: Leaving directory '/builds/packaging/deb-redis/build/icinga-redis'
make[1]: *** [Makefile:9: install] Error 2
dh_auto_install: error: make -j6 install DESTDIR=/builds/packaging/deb-redis/build/icinga-redis/debian/icinga-redis AM_UPDATE_INFO_DIR=no "INSTALL=install --strip-program=true" returned exit code 2
make: *** [debian/rules:31: binary] Error 25
dpkg-buildpackage: error: debian/rules binary subprocess returned exit status 2
[ binary build failed! ]
Cleaning up file based variables
ERROR: Job failed: exit code 1
failed
build/debian/buster Build
make[2]: Leaving directory '/builds/packaging/deb-redis/build/icinga-redis/src'
make[1]: *** [Makefile:9: install] Error 2
make[1]: Leaving directory '/builds/packaging/deb-redis/build/icinga-redis'
dh_auto_install: make -j6 install DESTDIR=/builds/packaging/deb-redis/build/icinga-redis/debian/icinga-redis AM_UPDATE_INFO_DIR=no "INSTALL=install --strip-program=true" returned exit code 2
make: *** [debian/rules:31: binary] Error 2
dpkg-buildpackage: error: debian/rules binary subprocess returned exit status 2
[ binary build failed! ]
Cleaning up file based variables
ERROR: Job failed: exit code 1