Increase version to 6.2.4

9 jobs for update/6.2.4 in 1 minute and 12 seconds (queued for 99 minutes and 1 second)
Status Name Job ID Coverage
  Build
failed build/debian/buster #110136
docker

00:01:12

failed build/ubuntu/bionic #110137
docker

00:00:59

failed build/ubuntu/focal #110138
docker

00:00:51

failed build/debian/buster #110074
docker

failed build/ubuntu/bionic #110076
docker

failed build/ubuntu/focal #110075
docker

 
  Test
skipped test/debian/buster #110077
docker
skipped test/ubuntu/bionic #110079
docker
skipped test/ubuntu/focal #110078
docker
 
Name Stage Failure
failed
build/debian/buster Build
dh: warning: 
dh: warning: Hint: If you just added a build-dependency on debhelper-compat, then please remember to remove debian/compat
dh: warning:
dh: error: debhelper compat level specified both in debian/compat and via build-dependency on debhelper-compat
make: *** [debian/rules:31: clean] Error 25
dpkg-buildpackage: error: debian/rules clean subprocess returned exit status 2
[ binary build failed! ]
Cleaning up file based variables
ERROR: Job failed: exit code 1
failed
build/ubuntu/bionic Build
  libjemalloc-dev{a} libjemalloc1{a} liblua5.1-0{a} liblua5.1-0-dev{a} libreadline-dev{a} libssl-dev{a} libsystemd-dev{a} libtinfo-dev{a} lua-bitop{a} lua-bitop-dev{a} lua-cjson{a} lua-cjson-dev{a} tcl{a} tcl-tls{a} 
The following packages are RECOMMENDED but will NOT be installed:
libtool libtool-bin
0 packages upgraded, 14 newly installed, 0 to remove and 0 not upgraded.
Need to get 2549 kB of archives. After unpacking 12.7 MB will be used.
Abort.
[ binary build failed! ]
Cleaning up file based variables
ERROR: Job failed: exit code 1
failed
build/ubuntu/focal Build
  libhiredis-dev{a} libhiredis0.14{a} libjemalloc-dev{a} libjemalloc2{a} liblua5.1-0{a} liblua5.1-0-dev{a} libncurses-dev{a} libreadline-dev{a} libssl-dev{a} libsystemd-dev{a} lua-bitop{a} lua-bitop-dev{a} lua-cjson{a} lua-cjson-dev{a} pkg-config{a} tcl{a} tcl-tls{a} 
The following packages are RECOMMENDED but will NOT be installed:
libtool libtool-bin
0 packages upgraded, 17 newly installed, 0 to remove and 0 not upgraded.
Need to get 3458 kB of archives. After unpacking 18.1 MB will be used.
Abort.
[ binary build failed! ]
Cleaning up file based variables
ERROR: Job failed: exit code 1