Lower compat level

6 jobs for update/6.2.3 in 37 minutes and 24 seconds (queued for 4 seconds)
latest
Status Job ID Name Coverage
  Build
failed build/debian/buster #109461
docker

00:37:24

failed build/ubuntu/bionic #109463
docker

00:33:49

failed build/ubuntu/focal #109462
docker

00:34:20

 
  Test
skipped test/debian/buster #109464
docker
skipped test/ubuntu/bionic #109466
docker
skipped test/ubuntu/focal #109465
docker
 
Name Stage Failure
failed
build/ubuntu/bionic Build
make[1]: *** [install] Error 2
Makefile:9: recipe for target 'install' failed
dh_auto_install: make -j6 -O install DESTDIR=/builds/packaging/deb-redis/build/icinga-redis/debian/icinga-redis AM_UPDATE_INFO_DIR=no "INSTALL=install --strip-program=true" returned exit code 2
debian/rules:31: recipe for target 'binary' failed
make: *** [binary] Error 25
dpkg-buildpackage: error: debian/rules binary subprocess returned exit status 2
[ binary build failed! ]
Cleaning up file based variables
ERROR: Job failed: exit code 1
failed
build/ubuntu/focal Build
make[2]: Leaving directory '/builds/packaging/deb-redis/build/icinga-redis/src'
make[1]: *** [Makefile:9: install] Error 2
make[1]: Leaving directory '/builds/packaging/deb-redis/build/icinga-redis'
dh_auto_install: error: make -j6 install DESTDIR=/builds/packaging/deb-redis/build/icinga-redis/debian/icinga-redis AM_UPDATE_INFO_DIR=no "INSTALL=install --strip-program=true" returned exit code 2
make: *** [debian/rules:31: binary] Error 25
dpkg-buildpackage: error: debian/rules binary subprocess returned exit status 2
[ binary build failed! ]
Cleaning up file based variables
ERROR: Job failed: exit code 1
failed
build/debian/buster Build
make[2]: Leaving directory '/builds/packaging/deb-redis/build/icinga-redis/src'
make[1]: Leaving directory '/builds/packaging/deb-redis/build/icinga-redis'
make[1]: *** [Makefile:9: install] Error 2
dh_auto_install: make -j6 install DESTDIR=/builds/packaging/deb-redis/build/icinga-redis/debian/icinga-redis AM_UPDATE_INFO_DIR=no "INSTALL=install --strip-program=true" returned exit code 2
make: *** [debian/rules:31: binary] Error 2
dpkg-buildpackage: error: debian/rules binary subprocess returned exit status 2
[ binary build failed! ]
Cleaning up file based variables
ERROR: Job failed: exit code 1