Try removing some more patches

6 jobs for update/redis624 in 34 minutes and 41 seconds (queued for 3 seconds)
latest
Status Job ID Name Coverage
  Build
failed build/debian/buster #104840
docker

00:34:41

failed build/ubuntu/bionic #104842
docker

00:00:52

failed build/ubuntu/focal #104841
docker

00:00:43

 
  Test
skipped test/debian/buster #104843
docker
skipped test/ubuntu/bionic #104845
docker
skipped test/ubuntu/focal #104844
docker
 
Name Stage Failure
failed
build/debian/buster Build
debian/bin/generate-systemd-service-files
make[1]: debian/bin/generate-systemd-service-files: Command not found
make[1]: *** [debian/rules:64: override_dh_auto_install] Error 127
make[1]: Leaving directory '/builds/packaging/deb-redis/build/icinga-redis'
make: *** [debian/rules:31: binary] Error 2
dpkg-buildpackage: error: debian/rules binary subprocess returned exit status 2
[ binary build failed! ]
Cleaning up file based variables
ERROR: Job failed: exit code 1
failed
build/ubuntu/bionic Build
  libsystemd0 
The following packages are RECOMMENDED but will NOT be installed:
libtool libtool-bin
1 packages upgraded, 14 newly installed, 0 to remove and 9 not upgraded.
Need to get 2758 kB of archives. After unpacking 12.7 MB will be used.
Abort.
[ binary build failed! ]
Cleaning up file based variables
ERROR: Job failed: exit code 1
failed
build/ubuntu/focal Build
  libssl1.1 
The following packages are RECOMMENDED but will NOT be installed:
libtool libtool-bin
1 packages upgraded, 19 newly installed, 0 to remove and 9 not upgraded.
Need to get 4799 kB of archives. After unpacking 18.2 MB will be used.
Abort.
[ binary build failed! ]
Cleaning up file based variables
ERROR: Job failed: exit code 1