GitLab CI: Switch build type back to snapshot

9 jobs for master in 1 minute and 54 seconds (queued for 2 seconds)
latest
Status Job ID Name Coverage
  Build
failed #104704
docker
build/debian/buster

00:01:09

failed #104706
docker
build/ubuntu/bionic

00:01:30

failed #104705
docker
build/ubuntu/focal

00:01:05

 
  Test
skipped #104707
docker
test/debian/buster
skipped #104709
docker
test/ubuntu/bionic
skipped #104708
docker
test/ubuntu/focal
 
  Upload
skipped #104710
docker
upload/debian/buster
skipped #104712
docker
upload/ubuntu/bionic
skipped #104711
docker
upload/ubuntu/focal
 
Name Stage Failure
failed
build/ubuntu/bionic Build
Parsing meta tags from https://github.com?go-get=1 (status code 200)
can't load package: package github.com/icinga/icingadb/obj-x86_64-linux-gnu: unknown import path "github.com/icinga/icingadb/obj-x86_64-linux-gnu": cannot find module providing package github.com/icinga/icingadb/obj-x86_64-linux-gnu
dh_auto_build: cd obj-x86_64-linux-gnu && go generate -v returned exit code 1
make: *** [build] Error 1
debian/rules:19: recipe for target 'build' failed
dpkg-buildpackage: error: debian/rules build subprocess returned exit status 2
[ binary build failed! ]
Cleaning up file based variables
ERROR: Job failed: exit code 1
failed
build/debian/buster Build
Fetching https://github.com?go-get=1
Parsing meta tags from https://github.com?go-get=1 (status code 200)
can't load package: package github.com/icinga/icingadb/obj-x86_64-linux-gnu: unknown import path "github.com/icinga/icingadb/obj-x86_64-linux-gnu": cannot find module providing package github.com/icinga/icingadb/obj-x86_64-linux-gnu
dh_auto_build: cd obj-x86_64-linux-gnu && go generate -v returned exit code 1
make: *** [debian/rules:19: build] Error 1
dpkg-buildpackage: error: debian/rules build subprocess returned exit status 2
[ binary build failed! ]
Cleaning up file based variables
ERROR: Job failed: exit code 1
failed
build/ubuntu/focal Build
go: warning: "github.com/Icinga/icingadb/..." matched no packages
cd obj-x86_64-linux-gnu && go generate -v
build .: cannot find module for path .
dh_auto_build: error: cd obj-x86_64-linux-gnu && go generate -v returned exit code 1
make: *** [debian/rules:19: build] Error 25
dpkg-buildpackage: error: debian/rules build subprocess returned exit status 2
[ binary build failed! ]
Cleaning up file based variables
ERROR: Job failed: exit code 1