Add Debian Bullseye

8 jobs for feature/bullseye in 4 minutes and 4 seconds (queued for 7 seconds)
latest
Status Job ID Name Coverage
  Build
failed #99534
docker
build/debian/bullseye

00:02:27

passed #99535
docker
build/debian/buster

00:02:45

passed #99537
docker
build/ubuntu/bionic

00:02:44

passed #99536
docker
build/ubuntu/focal

00:03:50

 
  Test
skipped #99538
docker
test/debian/bullseye
skipped #99539
docker
test/debian/buster
skipped #99541
docker
test/ubuntu/bionic
skipped #99540
docker
test/ubuntu/focal
 
Name Stage Failure
failed
build/debian/bullseye Build
	cd obj-x86_64-linux-gnu && go generate -v
cd obj-x86_64-linux-gnu && go install -trimpath -v -p 1
no Go files in /builds/packaging/deb-icingadb/build/icingadb/obj-x86_64-linux-gnu
dh_auto_build: error: cd obj-x86_64-linux-gnu && go install -trimpath -v -p 1 returned exit code 1
make: *** [debian/rules:19: build] Error 25
dpkg-buildpackage: error: debian/rules build subprocess returned exit status 2
[ binary build failed! ]
Cleaning up file based variables
ERROR: Job failed: exit code 1