Merge branch 'master' into 2.12

33 jobs for 2.12 in 55 minutes and 11 seconds (queued for 8 minutes and 55 seconds)
Status Name Job ID Coverage
  Source
passed debian/buster #55430
docker

00:01:05

passed debian/jessie #55432
docker

00:01:01

passed debian/stretch #55431
docker

00:01:08

passed ubuntu/bionic #55435
docker

00:01:04

passed ubuntu/eoan #55434
docker

00:00:57

passed ubuntu/focal #55433
docker

00:00:58

passed ubuntu/xenial #55436
docker

00:00:58

 
  Binary
passed debian/buster:x86 #55438
docker

00:11:42

passed debian/buster:x86_64 #55437
docker

00:11:48

passed debian/jessie:x86 #55442
docker

00:38:33

passed debian/jessie:x86_64 #55441
docker

00:32:46

passed debian/stretch:x86 #55440
docker

00:09:03

passed debian/stretch:x86_64 #55439
docker

00:10:08

passed ubuntu/bionic:x86 #55447
docker

00:13:08

passed ubuntu/bionic:x86_64 #55446
docker

00:12:19

passed ubuntu/eoan:x86 #55445
docker

00:13:44

passed ubuntu/eoan:x86_64 #55444
docker

00:12:13

failed ubuntu/focal:x86_64 #55443
docker

00:01:38

passed ubuntu/xenial:x86 #55449
docker

00:22:18

passed ubuntu/xenial:x86_64 #55448
docker

00:18:27

 
  Test
skipped test/debian/buster:x86 #55451
docker
skipped test/debian/buster:x86_64 #55450
docker
skipped test/debian/jessie:x86 #55455
docker
skipped test/debian/jessie:x86_64 #55454
docker
skipped test/debian/stretch:x86 #55453
docker
skipped test/debian/stretch:x86_64 #55452
docker
skipped test/ubuntu/bionic:x86 #55460
docker
skipped test/ubuntu/bionic:x86_64 #55459
docker
skipped test/ubuntu/eoan:x86 #55458
docker
skipped test/ubuntu/eoan:x86_64 #55457
docker
skipped test/ubuntu/focal:x86_64 #55456
docker
skipped test/ubuntu/xenial:x86 #55462
docker
skipped test/ubuntu/xenial:x86_64 #55461
docker
 
Name Stage Failure
failed
ubuntu/focal:x86_64 Binary



dh_auto_configure: error: cd obj-x86_64-linux-gnu && cmake -DCMAKE_INSTALL_PREFIX=/usr -DCMAKE_BUILD_TYPE=None -DCMAKE_INSTALL_SYSCONFDIR=/etc -DCMAKE_INSTALL_LOCALSTATEDIR=/var -DCMAKE_EXPORT_NO_PACKAGE_REGISTRY=ON -DCMAKE_FIND_PACKAGE_NO_PACKAGE_REGISTRY=ON "-GUnix Makefiles" -DCMAKE_VERBOSE_MAKEFILE=ON -DCMAKE_AUTOGEN_VERBOSE=ON -DCMAKE_INSTALL_LIBDIR=lib/x86_64-linux-gnu -DCMAKE_INSTALL_LOCALSTATEDIR=/var -DCMAKE_INSTALL_SYSCONFDIR=/etc -DICINGA2_SYSCONFIGFILE=/etc/default/icinga2 -DICINGA2_RUNDIR=/run -DICINGA2_USER=nagios -DICINGA2_GROUP=nagios -DICINGA2_COMMAND_GROUP=www-data -DICINGA2_GIT_VERSION_INFO=false -DICINGA2_PLUGINDIR=/usr/lib/nagios/plugins -DUSE_SYSTEMD=ON -DICINGA2_LTO_BUILD=On .. returned exit code 1
make[1]: *** [debian/rules:60: override_dh_auto_configure] Error 25
make[1]: Leaving directory '/builds/packaging/deb-icinga2/build/icinga2'
make: *** [debian/rules:46: build] Error 2
dpkg-buildpackage: error: debian/rules build subprocess returned exit status 2
ERROR: Job failed: exit code 1